BDBM50292977 2-(3,4-dimethoxy-N-p-tolylphenylsulfonamido)-N,N-diethylacetamide::CHEMBL510425
SMILES CCN(CC)C(=O)CN(c1ccc(C)cc1)S(=O)(=O)c1ccc(OC)c(OC)c1
InChI Key InChIKey=XYNNXNVPFFLPEB-UHFFFAOYSA-N
Data  4 IC50
  Tab Delimited (TSV)   2D SDfile   Computed 3D by Vconf -m prep SDfile
Find this compound or compounds like it in BindingDB:
Activity Spreadsheet -- Enzyme Inhibition Constant Data from BindingDB
Found 4 hits for monomerid = 50292977
TargetOrexin/Hypocretin receptor type 1(Homo sapiens (Human))
Actelion Pharmaceuticals
Curated by ChEMBL
LigandPNGBDBM50292977(2-(3,4-dimethoxy-N-p-tolylphenylsulfonamido)-N,N-d...)
Affinity DataIC50: >1.00E+4nM. Assay description: Antagonist activity at OX1 receptor by FLIPR
In DepthDetails ArticlePubMed
TargetOrexin receptor type 2(Homo sapiens (Human))
Actelion Pharmaceuticals
Curated by ChEMBL
LigandPNGBDBM50292977(2-(3,4-dimethoxy-N-p-tolylphenylsulfonamido)-N,N-d...)
Affinity DataIC50:  19nM. Assay description: Inhibition of human OX2 receptor expressed in CHO cells assessed as intercellular calcium mobilization by FLIPR assay
In DepthDetails ArticlePubMed
TargetOrexin/Hypocretin receptor type 1(Homo sapiens (Human))
Actelion Pharmaceuticals
Curated by ChEMBL
LigandPNGBDBM50292977(2-(3,4-dimethoxy-N-p-tolylphenylsulfonamido)-N,N-d...)
Affinity DataIC50: >1.00E+4nM. Assay description: Inhibition of human OX1 receptor expressed in CHO cells assessed as intercellular calcium mobilization by FLIPR assay
In DepthDetails ArticlePubMed
TargetOrexin receptor type 2(Homo sapiens (Human))
Actelion Pharmaceuticals
Curated by ChEMBL
LigandPNGBDBM50292977(2-(3,4-dimethoxy-N-p-tolylphenylsulfonamido)-N,N-d...)
Affinity DataIC50:  19nM. Assay description: Antagonist activity at OX2 receptor by FLIPR
In DepthDetails ArticlePubMed